Target
Angiopoietin-1 receptor
Ligand
BDBM50375194
Substrate
Meas. Tech.
ChEMBL_470292 (CHEMBL950344)
IC50
24±n/a nM
Citation
 Underiner, TLRuggeri, BAimone, LAlbom, MAngeles, TChang, HHudkins, RLHunter, KJosef, KRobinson, CWeinberg, LYang, SZulli, A TIE-2/VEGF-R2 SAR and in vitro activity of C3-acyl dihydroindazolo[5,4-a]pyrrolo[3,4-c]carbazole analogs. Bioorg Med Chem Lett 18:2368-72 (2008)  
Target
Name:
Angiopoietin-1 receptor
Synonyms:
TEK TIE2_HUMAN Tyrosine-protein kinase receptor (TIE-2) Tyrosine-protein kinase receptor TEK (p140 TEK) Tyrosine-protein kinase receptor TIE2/TEK VMCM1 p140 TEK
Type:
Enzyme
Mol. Mass.:
125835.70
Organism:
Homo sapiens (Human)
Description:
Q02763
Residue:
1124
  
Inhibitor
Name:
BDBM50375194
Synonyms:
CHEMBL402182
Type:
Small organic molecule
Emp. Form.:
C28H24N4O2S
Mol. Mass.:
480.581
SMILES:
CC(C)n1c2ccc(cc2c2c3CNC(=O)c3c3-c4cn(C)nc4CCc3c12)C(=O)c1cccs1
: