Target
Vascular endothelial growth factor receptor 2
Ligand
BDBM50375203
Substrate
Meas. Tech.
ChEMBL_470296 (CHEMBL950348)
IC50
>50±n/a nM
Citation
 Underiner, TLRuggeri, BAimone, LAlbom, MAngeles, TChang, HHudkins, RLHunter, KJosef, KRobinson, CWeinberg, LYang, SZulli, A TIE-2/VEGF-R2 SAR and in vitro activity of C3-acyl dihydroindazolo[5,4-a]pyrrolo[3,4-c]carbazole analogs. Bioorg Med Chem Lett 18:2368-72 (2008)  
Target
Name:
Vascular endothelial growth factor receptor 2
Synonyms:
Flk-1 Kdr VGFR2_MOUSE | Vascular endothelial growth factor receptor 2
Type:
PROTEIN
Mol. Mass.:
152506.58
Organism:
Mus musculus
Description:
ChEMBL_1469997
Residue:
1367
  
Inhibitor
Name:
BDBM50375203
Synonyms:
CHEMBL271861
Type:
Small organic molecule
Emp. Form.:
C30H28N4O2S
Mol. Mass.:
508.634
SMILES:
CC(C)Cn1c2ccc(cc2c2c3CNC(=O)c3c3-c4cn(C)nc4CCc3c12)C(=O)c1cc(C)cs1
: