Target
RAF proto-oncogene serine/threonine-protein kinase
Ligand
BDBM50132260
Substrate
Meas. Tech.
ChEMBL_470479 (CHEMBL951323)
IC50
12±n/a nM
Citation
 Zhu, TJiao, YChen, YDWang, XLi, HFZhang, LYLu, T Pharmacophore identification of Raf-1 kinase inhibitors. Bioorg Med Chem Lett 18:2346-50 (2008)  
Target
Name:
RAF proto-oncogene serine/threonine-protein kinase
Synonyms:
C-Raf Protein Kinase RAF RAF1 Raf-1 Serine/threonine-protein kinase C-Raf | cRaf
Type:
Serine/threonine-protein kinase
Mol. Mass.:
73082.52
Organism:
Homo sapiens (Human)
Description:
P04049
Residue:
648
  
Inhibitor
Name:
BDBM50132260
Synonyms:
2-(2-Chloro-4-iodo-phenylamino)-N-cyclopropylmethoxy-3,4-difluoro-benzamide CHEMBL105442 PD-18435 US8575391, 341
Type:
Small organic molecule
Emp. Form.:
C17H14ClF2IN2O2
Mol. Mass.:
478.66
SMILES:
Fc1ccc(C(=O)NOCC2CC2)c(Nc2ccc(I)cc2Cl)c1F
: