Target
Thyroid hormone receptor alpha
Ligand
BDBM50375345
Substrate
Meas. Tech.
ChEMBL_471204 (CHEMBL939183)
EC50
10±n/a nM
Citation
 Ocasio, CAScanlan, TS Characterization of thyroid hormone receptor alpha (TRalpha)-specific analogs with varying inner- and outer-ring substituents. Bioorg Med Chem 16:762-70 (2008)  
Target
Name:
Thyroid hormone receptor alpha
Synonyms:
C-erbA-alpha EAR7 NR1A1 THA_HUMAN THRA1 Thyroid Hormone Receptor (TR-alpha) Thyroid hormone receptor alpha c-erbA-1
Type:
Receptor
Mol. Mass.:
54818.00
Organism:
Homo sapiens (Human)
Description:
Recombinant hThR was obtained from nuclear extracts from SF9 cells infected with baculovirus vectors encoding for ThRalpha 1.
Residue:
490
  
Inhibitor
Name:
BDBM50375345
Synonyms:
CHEMBL264153
Type:
Small organic molecule
Emp. Form.:
C18H16I2N2O4
Mol. Mass.:
578.1396
SMILES:
CCc1cc(Oc2c(I)cc(Cc3[nH]c(=O)[nH]c3O)cc2I)ccc1O
: