Target
5-hydroxytryptamine receptor 2A
Ligand
BDBM50375457
Substrate
Meas. Tech.
ChEMBL_472647 (CHEMBL921963)
Ki
0.78±n/a nM
Citation
 Shimada, IMaeno, KKazuta, KKubota, HKimizuka, TKimura, YHatanaka, KNaitou, YWanibuchi, FSakamoto, STsukamoto, S Synthesis and structure-activity relationships of a series of substituted 2-(1H-furo[2,3-g]indazol-1-yl)ethylamine derivatives as 5-HT2C receptor agonists. Bioorg Med Chem 16:1966-82 (2008)  
Target
Name:
5-hydroxytryptamine receptor 2A
Synonyms:
5-HT-2 5-HT2A 5-hydroxytryptamine receptor 2A (5HT-2A) 5HT2A_HUMAN HTR2A | Serotonin receptor 2A
Type:
undefined
Mol. Mass.:
52607.65
Organism:
Homo sapiens (Human)
Description:
P28223
Residue:
471
  
Inhibitor
Name:
BDBM50375457
Synonyms:
CHEMBL261476
Type:
Small organic molecule
Emp. Form.:
C12H13N3O
Mol. Mass.:
215.2511
SMILES:
C[C@H](N)Cn1ncc2ccc3occc3c12
: