Target
Adenosine receptor A1
Ligand
BDBM50375485
Substrate
Meas. Tech.
ChEMBL_472687 (CHEMBL922854)
Ki
17.3±n/a nM
Citation
 van Veldhoven, JPChang, LCvon Frijtag Drabbe Künzel, JKMulder-Krieger, TStruensee-Link, RBeukers, MWBrussee, JIJzerman, AP A new generation of adenosine receptor antagonists: from di- to trisubstituted aminopyrimidines. Bioorg Med Chem 16:2741-52 (2008)  
Target
Name:
Adenosine receptor A1
Synonyms:
A1 adenosine receptor (hA1) AA1R_HUMAN ADORA1 Adenosine A1-receptor Adenosine receptor A1 (hA1) | Adenosine transporter (AdT)
Type:
G Protein-Coupled Receptor (GPCR)
Mol. Mass.:
36520.92
Organism:
Homo sapiens (Human)
Description:
P30542
Residue:
326
  
Inhibitor
Name:
BDBM50375485
Synonyms:
CHEMBL259392
Type:
Small organic molecule
Emp. Form.:
C23H21N3O3
Mol. Mass.:
387.4311
SMILES:
O=C(Nc1cc(nc(n1)-c1ccccc1)-c1ccc2OCOc2c1)C1CCCC1
: