Target
C-C chemokine receptor type 2
Ligand
BDBM50375730
Substrate
Meas. Tech.
ChEMBL_473977 (CHEMBL933958)
IC50
3.9±n/a nM
Citation
 Moree, WJKataoka, KRamirez-Weinhouse, MMShiota, TImai, MTsutsumi, TSudo, MEndo, NMuroga, YHada, TFanning, DSaunders, JKato, YMyers, PLTarby, CM Potent antagonists of the CCR2b receptor. Part 3: SAR of the (R)-3-aminopyrrolidine series. Bioorg Med Chem Lett 18:1869-73 (2008)  
Target
Name:
C-C chemokine receptor type 2
Synonyms:
C-C chemokine receptor type 2 (CCR2) CCR2_HUMAN Chemoattractant Cytokine Receptor 2 (CCR2) Monocyte chemotactic protein-1 (MCP-1)
Type:
Enzyme
Mol. Mass.:
41932.32
Organism:
Homo sapiens (Human)
Description:
P41597
Residue:
374
  
Inhibitor
Name:
BDBM50375730
Synonyms:
CHEMBL257066
Type:
Small organic molecule
Emp. Form.:
C23H25F3N4O2
Mol. Mass.:
446.4654
SMILES:
Nc1ccc(cc1C(=O)NCC(=O)N[C@@H]1CCN(Cc2ccc(C=C)cc2)C1)C(F)(F)F
: