Target
Beta-3 adrenergic receptor
Ligand
BDBM50375895
Substrate
Meas. Tech.
ChEMBL_474618 (CHEMBL936719)
EC50
3.9±n/a nM
Citation
 Perrone, MGSantandrea, EBleve, LVitale, PColabufo, NAJockers, RMilazzo, FMSciarroni, AFScilimati, A Stereospecific synthesis and bio-activity of novel beta(3)-adrenoceptor agonists and inverse agonists. Bioorg Med Chem 16:2473-88 (2008)  
Target
Name:
Beta-3 adrenergic receptor
Synonyms:
ADRB3 ADRB3_HUMAN Beta-2 adrenergic receptor and beta-3 adrenergic receptor Beta-3 adrenoreceptor | adrenergic Beta3
Type:
G Protein-Coupled Receptor (GPCR)
Mol. Mass.:
43534.88
Organism:
Homo sapiens (Human)
Description:
Residue:
408
  
Inhibitor
Name:
BDBM50375895
Synonyms:
CHEMBL260393
Type:
Small organic molecule
Emp. Form.:
C20H25NO4
Mol. Mass.:
343.4168
SMILES:
CC(C)(Oc1ccc(CCNC[C@H](O)c2ccccc2)cc1)C(O)=O
: