Target
5-hydroxytryptamine receptor 2C
Ligand
BDBM50375450
Substrate
Meas. Tech.
ChEMBL_474628 (CHEMBL936729)
Ki
0.89±n/a nM
Citation
 Shimada, IMaeno, KKondoh, YKaku, HSugasawa, KKimura, YHatanaka, KNaitou, YWanibuchi, FSakamoto, STsukamoto, S Synthesis and structure-activity relationships of a series of benzazepine derivatives as 5-HT2C receptor agonists. Bioorg Med Chem 16:3309-20 (2008)  
Target
Name:
5-hydroxytryptamine receptor 2C
Synonyms:
5-HT-1C 5-HT1C 5-HT2C-INI 5-HTR2C 5-hydroxytryptamine receptor 2C (5-HT-2C) 5HT-1C HTR1C Serotonin (5-HT3) receptor Serotonin Receptor 2C
Type:
G Protein-Coupled Receptor (GPCR)
Mol. Mass.:
51836.79
Organism:
Homo sapiens (Human)
Description:
P28335
Residue:
458
  
Inhibitor
Name:
BDBM50375450
Synonyms:
CHEMBL407909 | YM-348
Type:
Small organic molecule
Emp. Form.:
C14H17N3O
Mol. Mass.:
243.3043
SMILES:
CCc1cc2c(ccc3cnn(C[C@H](C)N)c23)o1
: