Target
Carbonic anhydrase 15
Ligand
BDBM26196
Substrate
Meas. Tech.
ChEMBL_479319 (CHEMBL933691)
Ki
434000±n/a nM
Citation
 Innocenti, AHilvo, MScozzafava, AParkkila, SSupuran, CT Carbonic anhydrase inhibitors: Inhibition of the new membrane-associated isoform XV with phenols. Bioorg Med Chem Lett 18:3593-6 (2008)  
Target
Name:
Carbonic anhydrase 15
Synonyms:
CAH15_MOUSE Car15
Type:
PROTEIN
Mol. Mass.:
35484.02
Organism:
Mus musculus
Description:
ChEMBL_651955
Residue:
324
  
Inhibitor
Name:
BDBM26196
Synonyms:
4-cyanophenol phenol derivative, 10
Type:
Small organic molecule
Emp. Form.:
C7H5NO
Mol. Mass.:
119.1207
SMILES:
Oc1ccc(cc1)C#N
: