Target
Carbonic anhydrase 15
Ligand
BDBM26191
Substrate
Meas. Tech.
ChEMBL_479319 (CHEMBL933691)
Ki
212000±n/a nM
Citation
 Innocenti, AHilvo, MScozzafava, AParkkila, SSupuran, CT Carbonic anhydrase inhibitors: Inhibition of the new membrane-associated isoform XV with phenols. Bioorg Med Chem Lett 18:3593-6 (2008)  
Target
Name:
Carbonic anhydrase 15
Synonyms:
CAH15_MOUSE Car15
Type:
PROTEIN
Mol. Mass.:
35484.02
Organism:
Mus musculus
Description:
ChEMBL_651955
Residue:
324
  
Inhibitor
Name:
BDBM26191
Synonyms:
2,5-difluorophenol | phenol derivative, 5
Type:
Small organic molecule
Emp. Form.:
C6H4F2O
Mol. Mass.:
130.0922
SMILES:
Oc1cc(F)ccc1F
: