Target
Carbonic anhydrase 15
Ligand
BDBM26189
Substrate
Meas. Tech.
ChEMBL_479319 (CHEMBL933691)
Ki
385000±n/a nM
Citation
 Innocenti, AHilvo, MScozzafava, AParkkila, SSupuran, CT Carbonic anhydrase inhibitors: Inhibition of the new membrane-associated isoform XV with phenols. Bioorg Med Chem Lett 18:3593-6 (2008)  
Target
Name:
Carbonic anhydrase 15
Synonyms:
CAH15_MOUSE Car15
Type:
PROTEIN
Mol. Mass.:
35484.02
Organism:
Mus musculus
Description:
ChEMBL_651955
Residue:
324
  
Inhibitor
Name:
BDBM26189
Synonyms:
α-CA inhibitor, 13 1,3-dihydroxybenzene US9688816, 4 phenol derivative, 3
Type:
Small organic molecule
Emp. Form.:
C6H6O2
Mol. Mass.:
110.1106
SMILES:
Oc1cccc(O)c1
: