Target
Carbonic anhydrase 1
Ligand
BDBM26195
Substrate
Meas. Tech.
ChEMBL_479317 (CHEMBL933689)
Ki
159000±n/a nM
Citation
 Innocenti, AHilvo, MScozzafava, AParkkila, SSupuran, CT Carbonic anhydrase inhibitors: Inhibition of the new membrane-associated isoform XV with phenols. Bioorg Med Chem Lett 18:3593-6 (2008)  
Target
Name:
Carbonic anhydrase 1
Synonyms:
CA-I CAB Carbonate dehydratase I Carbonic anhydrase 1 (CA I) Carbonic anhydrase 1 (Recombinant CA I) Carbonic anhydrase B Carbonic anhydrase I (CA I) Carbonic anhydrase I (CAI) Carbonic anhydrase isoenzyme I (hCA I) | hCA
Type:
Enzyme
Mol. Mass.:
28873.37
Organism:
Homo sapiens (Human)
Description:
P00915
Residue:
261
  
Inhibitor
Name:
BDBM26195
Synonyms:
4-aminophenol | phenol derivative, 9
Type:
Small organic molecule
Emp. Form.:
C6H7NO
Mol. Mass.:
109.1259
SMILES:
Nc1ccc(O)cc1
: