Target
Carbonic anhydrase 1
Ligand
BDBM26189
Substrate
Meas. Tech.
ChEMBL_479317 (CHEMBL933689)
Ki
795000±n/a nM
Citation
 Innocenti, AHilvo, MScozzafava, AParkkila, SSupuran, CT Carbonic anhydrase inhibitors: Inhibition of the new membrane-associated isoform XV with phenols. Bioorg Med Chem Lett 18:3593-6 (2008)  
Target
Name:
Carbonic anhydrase 1
Synonyms:
CA-I CAB Carbonate dehydratase I Carbonic anhydrase 1 (CA I) Carbonic anhydrase 1 (Recombinant CA I) Carbonic anhydrase B Carbonic anhydrase I (CA I) Carbonic anhydrase I (CAI) Carbonic anhydrase isoenzyme I (hCA I) | hCA
Type:
Enzyme
Mol. Mass.:
28873.37
Organism:
Homo sapiens (Human)
Description:
P00915
Residue:
261
  
Inhibitor
Name:
BDBM26189
Synonyms:
α-CA inhibitor, 13 1,3-dihydroxybenzene US9688816, 4 phenol derivative, 3
Type:
Small organic molecule
Emp. Form.:
C6H6O2
Mol. Mass.:
110.1106
SMILES:
Oc1cccc(O)c1
: