Target
Carbonic anhydrase 2
Ligand
BDBM26190
Substrate
Meas. Tech.
ChEMBL_479318 (CHEMBL933690)
Ki
90±n/a nM
Citation
 Innocenti, AHilvo, MScozzafava, AParkkila, SSupuran, CT Carbonic anhydrase inhibitors: Inhibition of the new membrane-associated isoform XV with phenols. Bioorg Med Chem Lett 18:3593-6 (2008)  
Target
Name:
Carbonic anhydrase 2
Synonyms:
CA-II CAC Carbonate dehydratase II Carbonic anhydrase 2 (CA-II) Carbonic anhydrase C Carbonic anhydrase II (CA-II) Carbonic anhydrase II (hCA II) | Carbonic anhydrase isoenzyme II (hCA II)
Type:
Enzyme
Mol. Mass.:
29250.71
Organism:
Homo sapiens (Human)
Description:
P00918
Residue:
260
  
Inhibitor
Name:
BDBM26190
Synonyms:
1,4-Dihydroxybenzene, XIII CHEMBL537 Hydroquinone, HQ phenol derivative, 4
Type:
Small organic molecule
Emp. Form.:
C6H6O2
Mol. Mass.:
110.1106
SMILES:
Oc1ccc(O)cc1
: