Target
Thrombopoietin receptor
Ligand
BDBM50377373
Substrate
Meas. Tech.
ChEMBL_479602 (CHEMBL926798)
EC50
5200±n/a nM
Citation
 Reiter, LAJones, CSBrissette, WHMcCurdy, SPAbramov, YABordner, JDiCapua, FMMunchhof, MJRescek, DMSamardjiev, IJWithka, JM Molecular features crucial to the activity of pyrimidine benzamide-based thrombopoietin receptor agonists. Bioorg Med Chem Lett 18:3000-6 (2008)  
Target
Name:
Thrombopoietin receptor
Synonyms:
C-mpl MPL TPO-R TPOR_HUMAN
Type:
PROTEIN
Mol. Mass.:
71243.48
Organism:
Homo sapiens (Human)
Description:
ChEMBL_535587
Residue:
635
  
Inhibitor
Name:
BDBM50377373
Synonyms:
CHEMBL261539
Type:
Small organic molecule
Emp. Form.:
C10H6F4N2S
Mol. Mass.:
262.227
SMILES:
Nc1nc(cs1)-c1cc(ccc1F)C(F)(F)F
: