Target
Coagulation factor X
Ligand
BDBM50377634
Substrate
Meas. Tech.
ChEMBL_479811 (CHEMBL930381)
Ki
2±n/a nM
Citation
 Corte, JRFang, TPinto, DJHan, WHu, ZJiang, XJLi, YLGauuan, JFHadden, MOrton, DRendina, ARLuettgen, JMWong, PCHe, KMorin, PEChang, CHCheney, DLKnabb, RMWexler, RRLam, PY Structure-activity relationships of anthranilamide-based factor Xa inhibitors containing piperidinone and pyridinone P4 moieties. Bioorg Med Chem Lett 18:2845-9 (2008)  
Target
Name:
Coagulation factor X
Synonyms:
Activated coagulation factor X (FXa) Coagulation factor X precursor F10 Factor X heavy chain Factor Xa Stuart-Prower factor
Type:
Enzyme
Mol. Mass.:
54726.60
Organism:
Homo sapiens (Human)
Description:
Residue:
488
  
Inhibitor
Name:
BDBM50377634
Synonyms:
CHEMBL428432
Type:
Small organic molecule
Emp. Form.:
C25H24ClN5O5S
Mol. Mass.:
542.007
SMILES:
CS(=O)(=O)Nc1ccc(NC(=O)c2ccc(cc2)N2CCCCC2=O)c(c1)C(=O)Nc1ccc(Cl)cn1
: