Target
Coagulation factor X
Ligand
BDBM50377639
Substrate
Meas. Tech.
ChEMBL_479811 (CHEMBL930381)
Ki
2.2±n/a nM
Citation
 Corte, JRFang, TPinto, DJHan, WHu, ZJiang, XJLi, YLGauuan, JFHadden, MOrton, DRendina, ARLuettgen, JMWong, PCHe, KMorin, PEChang, CHCheney, DLKnabb, RMWexler, RRLam, PY Structure-activity relationships of anthranilamide-based factor Xa inhibitors containing piperidinone and pyridinone P4 moieties. Bioorg Med Chem Lett 18:2845-9 (2008)  
Target
Name:
Coagulation factor X
Synonyms:
Activated coagulation factor X (FXa) Coagulation factor X precursor F10 Factor X heavy chain Factor Xa Stuart-Prower factor
Type:
Enzyme
Mol. Mass.:
54726.60
Organism:
Homo sapiens (Human)
Description:
Residue:
488
  
Inhibitor
Name:
BDBM50377639
Synonyms:
CHEMBL258188
Type:
Small organic molecule
Emp. Form.:
C25H16ClN5O3
Mol. Mass.:
469.879
SMILES:
Clc1ccc(NC(=O)c2cc(ccc2NC(=O)c2ccc(cc2)-n2ccccc2=O)C#N)nc1
: