Target
Coagulation factor X
Ligand
BDBM50377652
Substrate
Meas. Tech.
ChEMBL_479811 (CHEMBL930381)
Ki
1.1±n/a nM
Citation
 Corte, JRFang, TPinto, DJHan, WHu, ZJiang, XJLi, YLGauuan, JFHadden, MOrton, DRendina, ARLuettgen, JMWong, PCHe, KMorin, PEChang, CHCheney, DLKnabb, RMWexler, RRLam, PY Structure-activity relationships of anthranilamide-based factor Xa inhibitors containing piperidinone and pyridinone P4 moieties. Bioorg Med Chem Lett 18:2845-9 (2008)  
Target
Name:
Coagulation factor X
Synonyms:
Activated coagulation factor X (FXa) Coagulation factor X precursor F10 Factor X heavy chain Factor Xa Stuart-Prower factor
Type:
Enzyme
Mol. Mass.:
54726.60
Organism:
Homo sapiens (Human)
Description:
Residue:
488
  
Inhibitor
Name:
BDBM50377652
Synonyms:
CHEMBL256573
Type:
Small organic molecule
Emp. Form.:
C24H19ClN4O2
Mol. Mass.:
430.886
SMILES:
Clc1ccc(NC(=O)c2ccccc2NCc2ccc(cc2)-n2ccccc2=O)nc1
: