Target
Acetylcholinesterase
Ligand
BDBM50251185
Substrate
Meas. Tech.
ChEMBL_531267 (CHEMBL986117)
IC50
120700±n/a nM
Citation
 Wen, HLin, CQue, LGe, HMa, LCao, RWan, YPeng, WWang, ZSong, H Synthesis and biological evaluation of helicid analogues as novel acetylcholinesterase inhibitors. Eur J Med Chem 43:166-73 (2008)  
Target
Name:
Acetylcholinesterase
Synonyms:
ACES_ELEEL Acetylcholinesterase (EeAChE) | ache
Type:
Enzyme
Mol. Mass.:
71812.79
Organism:
Electrophorus electricus (Electric eel)
Description:
Residue:
633
  
Inhibitor
Name:
BDBM50251185
Synonyms:
1-(4-(O-beta-D-Glucopyranosyl) benzylidene) semicarbazide | CHEMBL513440
Type:
Small organic molecule
Emp. Form.:
C14H19N3O7
Mol. Mass.:
341.3166
SMILES:
NC(=O)NN=Cc1ccc(O[C@@H]2O[C@H](CO)[C@@H](O)[C@H](O)[C@H]2O)cc1
: