Target
Acetylcholinesterase
Ligand
BDBM50245886
Substrate
Meas. Tech.
ChEMBL_531267 (CHEMBL986117)
IC50
450±n/a nM
Citation
 Wen, HLin, CQue, LGe, HMa, LCao, RWan, YPeng, WWang, ZSong, H Synthesis and biological evaluation of helicid analogues as novel acetylcholinesterase inhibitors. Eur J Med Chem 43:166-73 (2008)  
Target
Name:
Acetylcholinesterase
Synonyms:
ACES_ELEEL Acetylcholinesterase (EeAChE) | ache
Type:
Enzyme
Mol. Mass.:
71812.79
Organism:
Electrophorus electricus (Electric eel)
Description:
Residue:
633
  
Inhibitor
Name:
BDBM50245886
Synonyms:
4-((2S,3R,4S,5S,6R)-3,4,5-trihydroxy-6-(hydroxymethyl)-tetrahydro-2H-pyran-2-yloxy)benzaldehyde 4-formylphenyl-O-beta-D-glucopyranoside CHEMBL461515
Type:
Small organic molecule
Emp. Form.:
C13H16O7
Mol. Mass.:
284.2619
SMILES:
OC[C@H]1O[C@@H](Oc2ccc(C=O)cc2)[C@H](O)[C@@H](O)[C@@H]1O
: