Target
Acetylcholinesterase
Ligand
BDBM50251169
Substrate
Meas. Tech.
ChEMBL_531267 (CHEMBL986117)
IC50
9150±n/a nM
Citation
 Wen, HLin, CQue, LGe, HMa, LCao, RWan, YPeng, WWang, ZSong, H Synthesis and biological evaluation of helicid analogues as novel acetylcholinesterase inhibitors. Eur J Med Chem 43:166-73 (2008)  
Target
Name:
Acetylcholinesterase
Synonyms:
ACES_ELEEL Acetylcholinesterase (EeAChE) | ache
Type:
Enzyme
Mol. Mass.:
71812.79
Organism:
Electrophorus electricus (Electric eel)
Description:
Residue:
633
  
Inhibitor
Name:
BDBM50251169
Synonyms:
1-(4-(2,3,4,6-Tetra-O-acetyl-beta-D-glucopyranosyl) benzylidene)hydroxylamine CHEMBL569784
Type:
Small organic molecule
Emp. Form.:
C21H25NO11
Mol. Mass.:
467.4233
SMILES:
CC(=O)OC[C@H]1O[C@@H](Oc2ccc(CN=O)cc2)[C@H](OC(C)=O)[C@@H](OC(C)=O)[C@@H]1OC(C)=O
: