Target
Acetylcholinesterase
Ligand
BDBM50251160
Substrate
Meas. Tech.
ChEMBL_531267 (CHEMBL986117)
IC50
45420±n/a nM
Citation
 Wen, HLin, CQue, LGe, HMa, LCao, RWan, YPeng, WWang, ZSong, H Synthesis and biological evaluation of helicid analogues as novel acetylcholinesterase inhibitors. Eur J Med Chem 43:166-73 (2008)  
Target
Name:
Acetylcholinesterase
Synonyms:
ACES_ELEEL Acetylcholinesterase (EeAChE) | ache
Type:
Enzyme
Mol. Mass.:
71812.79
Organism:
Electrophorus electricus (Electric eel)
Description:
Residue:
633
  
Inhibitor
Name:
BDBM50251160
Synonyms:
(2R,3S,4S,5R,6S)-2-(acetoxymethyl)-6-(4-formylphenoxy)tetrahydro-2H-pyran-3,4,5-triyl triacetate CHEMBL465710
Type:
Small organic molecule
Emp. Form.:
C21H24O11
Mol. Mass.:
452.4087
SMILES:
CC(=O)OC[C@H]1O[C@@H](Oc2ccc(C=O)cc2)[C@H](OC(C)=O)[C@@H](OC(C)=O)[C@H]1OC(C)=O
: