Target
Cholinesterase
Ligand
BDBM50251189
Substrate
Meas. Tech.
ChEMBL_531268 (CHEMBL986118)
IC50
48720±n/a nM
Citation
 Wen, HLin, CQue, LGe, HMa, LCao, RWan, YPeng, WWang, ZSong, H Synthesis and biological evaluation of helicid analogues as novel acetylcholinesterase inhibitors. Eur J Med Chem 43:166-73 (2008)  
Target
Name:
Cholinesterase
Synonyms:
BCHE CHLE_HORSE | Cholinesterase
Type:
Enzyme
Mol. Mass.:
65643.35
Organism:
Equus caballus (Horse)
Description:
P81908
Residue:
574
  
Inhibitor
Name:
BDBM50251189
Synonyms:
1-(4-(2,3,4-Tri-O-benzoyl-beta-D-ribopyranosyl) benzylidene)semicarbazide | CHEMBL442866
Type:
Small organic molecule
Emp. Form.:
C34H29N3O9
Mol. Mass.:
623.6088
SMILES:
NC(=O)NN=Cc1ccc(O[C@@H]2OC[C@@H](OC(=O)c3ccccc3)[C@@H](OC(=O)c3ccccc3)[C@H]2OC(=O)c2ccccc2)cc1
: