Target
Acetylcholinesterase
Ligand
BDBM50377921
Substrate
Meas. Tech.
ChEMBL_552872 (CHEMBL960589)
IC50
4.04±n/a nM
Citation
 Camps, PFormosa, XGaldeano, CGómez, TMuñoz-Torrero, DScarpellini, MViayna, EBadia, AClos, MVCamins, APallàs, MBartolini, MMancini, FAndrisano, VEstelrich, JLizondo, MBidon-Chanal, ALuque, FJ Novel donepezil-based inhibitors of acetyl- and butyrylcholinesterase and acetylcholinesterase-induced beta-amyloid aggregation. J Med Chem 51:3588-98 (2008)  
Target
Name:
Acetylcholinesterase
Synonyms:
ACES_HUMAN Acetylcholinesterase (AChE) | Acetylcholinesterase (human AChE)
Type:
Enzyme
Mol. Mass.:
67792.70
Organism:
Homo sapiens (Human)
Description:
P22303
Residue:
614
  
Inhibitor
Name:
BDBM50377921
Synonyms:
SODIUM NITROPRUSSIDE
Type:
Small organic molecule
Emp. Form.:
C5FeN6O
Mol. Mass.:
215.939
SMILES:
O=N[Fe--](C#N)(C#N)(C#N)(C#N)C#N
: