Target
Acetylcholinesterase
Ligand
BDBM8987
Substrate
Meas. Tech.
ChEMBL_552871 (CHEMBL960588)
IC50
5.73±n/a nM
Citation
 Camps, PFormosa, XGaldeano, CGómez, TMuñoz-Torrero, DScarpellini, MViayna, EBadia, AClos, MVCamins, APallàs, MBartolini, MMancini, FAndrisano, VEstelrich, JLizondo, MBidon-Chanal, ALuque, FJ Novel donepezil-based inhibitors of acetyl- and butyrylcholinesterase and acetylcholinesterase-induced beta-amyloid aggregation. J Med Chem 51:3588-98 (2008)  
Target
Name:
Acetylcholinesterase
Synonyms:
ACES_BOVIN Acetylcholinesterase (AChE) | Acetylcholinesterase precursor
Type:
Enzyme
Mol. Mass.:
67659.62
Organism:
Bos taurus (bovine)
Description:
Residue:
613
  
Inhibitor
Name:
BDBM8987
Synonyms:
6-chloro-1,2,3,4-tetrahydroacridin-9-amine 6-chlorotacrine.HCl Tacrine Analogue 4
Type:
Small organic molecule
Emp. Form.:
C13H13ClN2
Mol. Mass.:
232.709
SMILES:
Nc1c2CCCCc2nc2cc(Cl)ccc12
: