Target
Cholinesterase
Ligand
BDBM50271190
Substrate
Meas. Tech.
ChEMBL_552873 (CHEMBL960590)
IC50
7.25±n/a nM
Citation
 Camps, PFormosa, XGaldeano, CGómez, TMuñoz-Torrero, DScarpellini, MViayna, EBadia, AClos, MVCamins, APallàs, MBartolini, MMancini, FAndrisano, VEstelrich, JLizondo, MBidon-Chanal, ALuque, FJ Novel donepezil-based inhibitors of acetyl- and butyrylcholinesterase and acetylcholinesterase-induced beta-amyloid aggregation. J Med Chem 51:3588-98 (2008)  
Target
Name:
Cholinesterase
Synonyms:
Acylcholine acylhydrolase Butyrylcholine esterase (BChE) Butyrylcholinesterase (BuChE) CHLE_HUMAN Cholinesterases Pseudocholinesterase
Type:
Homotetramer
Mol. Mass.:
68422.27
Organism:
Homo sapiens (Human)
Description:
P06276
Residue:
602
  
Inhibitor
Name:
BDBM50271190
Synonyms:
9-[(3-{4-[(5,6-dimethoxyindan-2-yl)methyl]piperidin-1-yl}propyl)amino]-1,2,3,4-tetrahydroacridine dihydrochloride | CHEMBL486508
Type:
Small organic molecule
Emp. Form.:
C33H43N3O2
Mol. Mass.:
513.7134
SMILES:
COc1cc2CC(CC3CCN(CCCNc4c5CCCCc5nc5ccccc45)CC3)Cc2cc1OC
: