Target
Acetylcholinesterase
Ligand
BDBM8979
Substrate
Meas. Tech.
ChEMBL_552874 (CHEMBL960591)
IC50
6±n/a nM
Citation
 Camps, PFormosa, XGaldeano, CGómez, TMuñoz-Torrero, DScarpellini, MViayna, EBadia, AClos, MVCamins, APallàs, MBartolini, MMancini, FAndrisano, VEstelrich, JLizondo, MBidon-Chanal, ALuque, FJ Novel donepezil-based inhibitors of acetyl- and butyrylcholinesterase and acetylcholinesterase-induced beta-amyloid aggregation. J Med Chem 51:3588-98 (2008)  
Target
Name:
Acetylcholinesterase
Synonyms:
ACES_RAT Acetylcholinesterase and butyrylcholinesterase (AChE and BChE) Acetylcholinesterase, AChE | Ache
Type:
Enzyme
Mol. Mass.:
68193.62
Organism:
Rattus norvegicus (rat)
Description:
P37136
Residue:
614
  
Inhibitor
Name:
BDBM8979
Synonyms:
CHEMBL486901 tacrine-E2020 analog 3
Type:
Small organic molecule
Emp. Form.:
C29H36N4O
Mol. Mass.:
456.6223
SMILES:
O=C(CNc1c2CCCCc2nc2ccccc12)NCCC1CCN(Cc2ccccc2)CC1
: