Target
Sex hormone-binding globulin
Ligand
BDBM50240921
Substrate
Meas. Tech.
ChEMBL_547404 (CHEMBL1025921)
IC50
52000±n/a nM
Citation
 Schöttner, MSpiteller, GGansser, D Lignans interfering with 5 alpha-dihydrotestosterone binding to human sex hormone-binding globulin. J Nat Prod 61:119-21 (1998)  
Target
Name:
Sex hormone-binding globulin
Synonyms:
SHBG Testis-specific androgen-binding protein
Type:
PROTEIN
Mol. Mass.:
43780.19
Organism:
Homo sapiens (Human)
Description:
ChEMBL_466706
Residue:
402
  
Inhibitor
Name:
BDBM50240921
Synonyms:
(-)-matairesinol (3R,4R)-3,4-Bis-(4-hydroxy-3-methoxy-benzyl)-dihydro-furan-2-one CHEMBL425148 | MATAIRESINOL
Type:
Small organic molecule
Emp. Form.:
C20H22O6
Mol. Mass.:
358.3851
SMILES:
COc1cc(C[C@H]2COC(=O)[C@@H]2Cc2ccc(O)c(OC)c2)ccc1O
: