Target
Sodium-dependent noradrenaline transporter
Ligand
BDBM50272743
Substrate
Meas. Tech.
ChEMBL_510091 (CHEMBL998745)
IC50
370±n/a nM
Citation
 Hudson, SKiankarimi, MEccles, WDwight, WMostofi, YSGenicot, MJFleck, BAGogas, KAparicio, AWang, HWen, JWade, WS Structure-activity relationships of chiral selective norepinephrine reuptake inhibitors (sNRI) with increased oxidative stability. Bioorg Med Chem Lett 18:4491-4 (2008)  
Target
Name:
Sodium-dependent noradrenaline transporter
Synonyms:
Monoamine transporter NET Noradrenaline Transporter (NET) Norepinephrine transporter protein (NET) SLC6A2 Sodium-dependent noradrenaline transporter (NET) | Solute carrier family 6 member 2
Type:
Multi-pass membrane protein
Mol. Mass.:
69337.72
Organism:
Homo sapiens (Human)
Description:
P23975
Residue:
617
  
Inhibitor
Name:
BDBM50272743
Synonyms:
CHEMBL498142 | N-methyl((3S,4S)-4-(o-tolyloxy)-3,4-dihydro-2H-chromen-3-yl)methanamine
Type:
Small organic molecule
Emp. Form.:
C18H21NO2
Mol. Mass.:
283.3648
SMILES:
CNC[C@H]1COc2ccccc2[C@H]1Oc1ccccc1C
: