Target
Sodium-dependent serotonin transporter
Ligand
BDBM50272691
Substrate
Meas. Tech.
ChEMBL_510092 (CHEMBL998746)
IC50
500±n/a nM
Citation
 Hudson, SKiankarimi, MEccles, WDwight, WMostofi, YSGenicot, MJFleck, BAGogas, KAparicio, AWang, HWen, JWade, WS Structure-activity relationships of chiral selective norepinephrine reuptake inhibitors (sNRI) with increased oxidative stability. Bioorg Med Chem Lett 18:4491-4 (2008)  
Target
Name:
Sodium-dependent serotonin transporter
Synonyms:
5-HT Transporter 5HTT SC6A4_HUMAN SLC6A4 Serotonin transporter (5HTT) Sodium-dependent serotonin transporter (SERT) | Solute carrier family 6 member 4
Type:
Multi-pass membrane protein
Mol. Mass.:
70322.51
Organism:
Homo sapiens (Human)
Description:
P31645
Residue:
630
  
Inhibitor
Name:
BDBM50272691
Synonyms:
((3S,4S)-4-(2-chlorophenoxy)-3,4-dihydro-1H-isochromen-3-yl)-N-methylmethanamine CHEMBL448375
Type:
Small organic molecule
Emp. Form.:
C17H18ClNO2
Mol. Mass.:
303.783
SMILES:
CNC[C@@H]1OCc2ccccc2[C@@H]1Oc1ccccc1Cl
: