Target
Cytochrome P450 2D6
Ligand
BDBM50272655
Substrate
Meas. Tech.
ChEMBL_510094 (CHEMBL998748)
IC50
740±n/a nM
Citation
 Hudson, SKiankarimi, MEccles, WDwight, WMostofi, YSGenicot, MJFleck, BAGogas, KAparicio, AWang, HWen, JWade, WS Structure-activity relationships of chiral selective norepinephrine reuptake inhibitors (sNRI) with increased oxidative stability. Bioorg Med Chem Lett 18:4491-4 (2008)  
Target
Name:
Cytochrome P450 2D6
Synonyms:
CP2D6_HUMAN CYP2DL1 Cytochrome P450 2D6 (CYP2D6) P450-DB1
Type:
Protein
Mol. Mass.:
55774.82
Organism:
Homo sapiens (Human)
Description:
P10635
Residue:
497
  
Inhibitor
Name:
BDBM50272655
Synonyms:
((3S,4S)-4-(3-fluoro-2-methylphenoxy)-3,4-dihydro-1H-isochromen-3-yl)-N-methylmethanamine | CHEMBL444742
Type:
Small organic molecule
Emp. Form.:
C18H20FNO2
Mol. Mass.:
301.3553
SMILES:
CNC[C@@H]1OCc2ccccc2[C@@H]1Oc1cccc(F)c1C
: