Target
Cytochrome P450 2D6
Ligand
BDBM50272747
Substrate
Meas. Tech.
ChEMBL_510094 (CHEMBL998748)
IC50
200±n/a nM
Citation
 Hudson, SKiankarimi, MEccles, WDwight, WMostofi, YSGenicot, MJFleck, BAGogas, KAparicio, AWang, HWen, JWade, WS Structure-activity relationships of chiral selective norepinephrine reuptake inhibitors (sNRI) with increased oxidative stability. Bioorg Med Chem Lett 18:4491-4 (2008)  
Target
Name:
Cytochrome P450 2D6
Synonyms:
CP2D6_HUMAN CYP2DL1 Cytochrome P450 2D6 (CYP2D6) P450-DB1
Type:
Protein
Mol. Mass.:
55774.82
Organism:
Homo sapiens (Human)
Description:
P10635
Residue:
497
  
Inhibitor
Name:
BDBM50272747
Synonyms:
((3S,4S)-4-(2-chlorophenoxy)-3,4-dihydro-2H-chromen-3-yl)-N-methylmethanamine | CHEMBL452429
Type:
Small organic molecule
Emp. Form.:
C17H18ClNO2
Mol. Mass.:
303.783
SMILES:
CNC[C@H]1COc2ccccc2[C@H]1Oc1ccccc1Cl
: