Target
Cytochrome P450 2D6
Ligand
BDBM50272719
Substrate
Meas. Tech.
ChEMBL_510094 (CHEMBL998748)
IC50
800±n/a nM
Citation
 Hudson, SKiankarimi, MEccles, WDwight, WMostofi, YSGenicot, MJFleck, BAGogas, KAparicio, AWang, HWen, JWade, WS Structure-activity relationships of chiral selective norepinephrine reuptake inhibitors (sNRI) with increased oxidative stability. Bioorg Med Chem Lett 18:4491-4 (2008)  
Target
Name:
Cytochrome P450 2D6
Synonyms:
CP2D6_HUMAN CYP2DL1 Cytochrome P450 2D6 (CYP2D6) P450-DB1
Type:
Protein
Mol. Mass.:
55774.82
Organism:
Homo sapiens (Human)
Description:
P10635
Residue:
497
  
Inhibitor
Name:
BDBM50272719
Synonyms:
CHEMBL526669 N-methyl((3R,4S)-4-(o-tolyloxy)isochroman-3-yl)methanamine
Type:
Small organic molecule
Emp. Form.:
C18H21NO2
Mol. Mass.:
283.3648
SMILES:
CNC[C@H]1OCc2ccccc2[C@@H]1Oc1ccccc1C
: