Target
Cytochrome P450 2D6
Ligand
BDBM50272687
Substrate
Meas. Tech.
ChEMBL_510094 (CHEMBL998748)
IC50
440±n/a nM
Citation
 Hudson, SKiankarimi, MEccles, WDwight, WMostofi, YSGenicot, MJFleck, BAGogas, KAparicio, AWang, HWen, JWade, WS Structure-activity relationships of chiral selective norepinephrine reuptake inhibitors (sNRI) with increased oxidative stability. Bioorg Med Chem Lett 18:4491-4 (2008)  
Target
Name:
Cytochrome P450 2D6
Synonyms:
CP2D6_HUMAN CYP2DL1 Cytochrome P450 2D6 (CYP2D6) P450-DB1
Type:
Protein
Mol. Mass.:
55774.82
Organism:
Homo sapiens (Human)
Description:
P10635
Residue:
497
  
Inhibitor
Name:
BDBM50272687
Synonyms:
((3S,4S)-4-(o-tolyloxy)-3,4-dihydro-2H-chromen-3-yl)methanamine | CHEMBL510352
Type:
Small organic molecule
Emp. Form.:
C17H19NO2
Mol. Mass.:
269.3383
SMILES:
Cc1ccccc1O[C@H]1[C@@H](CN)COc2ccccc12
: