Target
Progesterone receptor
Ligand
BDBM50270628
Substrate
Meas. Tech.
ChEMBL_553966 (CHEMBL965384)
IC50
59.2±n/a nM
Citation
 Zhang, PKern, JCTerefenko, EAFensome, AUnwalla, RZhang, ZCohen, JBerrodin, TJYudt, MRWinneker, RCWrobel, J 7-aryl 1,5-dihydro-benzo[e][1,4]oxazepin-2-ones and analogs as non-steroidal progesterone receptor antagonists. Bioorg Med Chem 16:6589-600 (2008)  
Target
Name:
Progesterone receptor
Synonyms:
NR3C3 PGR PRGR_HUMAN | progesterone
Type:
Protein
Mol. Mass.:
98979.52
Organism:
Homo sapiens (Human)
Description:
P06401
Residue:
933
  
Inhibitor
Name:
BDBM50270628
Synonyms:
3-(5-Ethyl-2-oxo-5-thien-3-yl-1,2,3,5-tetrahydro-4,1-benzoxazepin-7-yl)-5-fluorobenzonitrile | CHEMBL506297
Type:
Small organic molecule
Emp. Form.:
C22H17FN2O2S
Mol. Mass.:
392.446
SMILES:
CCC1(OCC(=O)Nc2ccc(cc12)-c1cc(F)cc(c1)C#N)c1ccsc1
: