Target
Progesterone receptor
Ligand
BDBM50118690
Substrate
Meas. Tech.
ChEMBL_553967 (CHEMBL965385)
IC50
90±n/a nM
Citation
 Zhang, PKern, JCTerefenko, EAFensome, AUnwalla, RZhang, ZCohen, JBerrodin, TJYudt, MRWinneker, RCWrobel, J 7-aryl 1,5-dihydro-benzo[e][1,4]oxazepin-2-ones and analogs as non-steroidal progesterone receptor antagonists. Bioorg Med Chem 16:6589-600 (2008)  
Target
Name:
Progesterone receptor
Synonyms:
NR3C3 PGR PRGR_HUMAN | progesterone
Type:
Protein
Mol. Mass.:
98979.52
Organism:
Homo sapiens (Human)
Description:
P06401
Residue:
933
  
Inhibitor
Name:
BDBM50118690
Synonyms:
3-(4,4-Dimethyl-2-oxo-1,4-dihydro-2H-benzo[d][1,3]oxazin-6-yl)-5-fluoro-benzonitrile CHEMBL136322
Type:
Small organic molecule
Emp. Form.:
C17H13FN2O2
Mol. Mass.:
296.2957
SMILES:
CC1(C)OC(=O)Nc2ccc(cc12)-c1cc(F)cc(c1)C#N
: