Target
Progesterone receptor
Ligand
BDBM50270636
Substrate
Meas. Tech.
ChEMBL_553966 (CHEMBL965384)
IC50
78.2±n/a nM
Citation
 Zhang, PKern, JCTerefenko, EAFensome, AUnwalla, RZhang, ZCohen, JBerrodin, TJYudt, MRWinneker, RCWrobel, J 7-aryl 1,5-dihydro-benzo[e][1,4]oxazepin-2-ones and analogs as non-steroidal progesterone receptor antagonists. Bioorg Med Chem 16:6589-600 (2008)  
Target
Name:
Progesterone receptor
Synonyms:
NR3C3 PGR PRGR_HUMAN | progesterone
Type:
Protein
Mol. Mass.:
98979.52
Organism:
Homo sapiens (Human)
Description:
P06401
Residue:
933
  
Inhibitor
Name:
BDBM50270636
Synonyms:
3-Fluoro-5-(5-isopropyl-5-thien-2-yl-2-thioxo-1,2,3,5-tetrahydo-4,1-benzoxazepin-7-yl)benzonitrile | CHEMBL488560
Type:
Small organic molecule
Emp. Form.:
C23H19FN2OS2
Mol. Mass.:
422.538
SMILES:
CC(C)C1(OCC(=S)Nc2ccc(cc12)-c1cc(F)cc(c1)C#N)c1cccs1
: