Target
Glucocorticoid receptor
Ligand
BDBM50270631
Substrate
Meas. Tech.
ChEMBL_553971 (CHEMBL965389)
IC50
1300±n/a nM
Citation
 Zhang, PKern, JCTerefenko, EAFensome, AUnwalla, RZhang, ZCohen, JBerrodin, TJYudt, MRWinneker, RCWrobel, J 7-aryl 1,5-dihydro-benzo[e][1,4]oxazepin-2-ones and analogs as non-steroidal progesterone receptor antagonists. Bioorg Med Chem 16:6589-600 (2008)  
Target
Name:
Glucocorticoid receptor
Synonyms:
GCR_HUMAN GRL Glucocorticoid receptor (GRFP) Nuclear receptor subfamily 3 group C member 1
Type:
Enzyme
Mol. Mass.:
85656.87
Organism:
Homo sapiens (Human)
Description:
P04150
Residue:
777
  
Inhibitor
Name:
BDBM50270631
Synonyms:
3-[5,5-Di(2-furyl)-2-oxo-1,2,3,5-tetrahydro-4,1-benzoxazepin-7-yl]-5-fluorobenzonitrile | CHEMBL487116
Type:
Small organic molecule
Emp. Form.:
C24H15FN2O4
Mol. Mass.:
414.3853
SMILES:
Fc1cc(cc(c1)-c1ccc2NC(=O)COC(c3ccco3)(c3ccco3)c2c1)C#N
: