Target
Glucocorticoid receptor
Ligand
BDBM50270575
Substrate
Meas. Tech.
ChEMBL_553971 (CHEMBL965389)
IC50
>3000±n/a nM
Citation
 Zhang, PKern, JCTerefenko, EAFensome, AUnwalla, RZhang, ZCohen, JBerrodin, TJYudt, MRWinneker, RCWrobel, J 7-aryl 1,5-dihydro-benzo[e][1,4]oxazepin-2-ones and analogs as non-steroidal progesterone receptor antagonists. Bioorg Med Chem 16:6589-600 (2008)  
Target
Name:
Glucocorticoid receptor
Synonyms:
GCR_HUMAN GRL Glucocorticoid receptor (GRFP) Nuclear receptor subfamily 3 group C member 1
Type:
Enzyme
Mol. Mass.:
85656.87
Organism:
Homo sapiens (Human)
Description:
P04150
Residue:
777
  
Inhibitor
Name:
BDBM50270575
Synonyms:
3-(5,5-Dimethyl-2-oxo-1,2,3,5-tetrahydro-4,1-benzoxazepin-7-yl)-5-fluorobenzonitrile | CHEMBL487728
Type:
Small organic molecule
Emp. Form.:
C18H15FN2O2
Mol. Mass.:
310.3223
SMILES:
CC1(C)OCC(=O)Nc2ccc(cc12)-c1cc(F)cc(c1)C#N
: