Target
Mineralocorticoid receptor
Ligand
BDBM50270630
Substrate
Meas. Tech.
ChEMBL_553972 (CHEMBL965390)
IC50
>3000±n/a nM
Citation
 Zhang, PKern, JCTerefenko, EAFensome, AUnwalla, RZhang, ZCohen, JBerrodin, TJYudt, MRWinneker, RCWrobel, J 7-aryl 1,5-dihydro-benzo[e][1,4]oxazepin-2-ones and analogs as non-steroidal progesterone receptor antagonists. Bioorg Med Chem 16:6589-600 (2008)  
Target
Name:
Mineralocorticoid receptor
Synonyms:
MCR MLR NR3C2 | Nuclear receptor subfamily 3 group C member 2
Type:
Enzyme
Mol. Mass.:
107076.42
Organism:
Homo sapiens (Human)
Description:
P08235
Residue:
984
  
Inhibitor
Name:
BDBM50270630
Synonyms:
3-[5-Ethyl-5-(2-furyl)-2-oxo-1,2,3,5-tetrahydro-4,1-benzoxazepin-7-yl]-5-fluorobenzonitrile | CHEMBL501080
Type:
Small organic molecule
Emp. Form.:
C22H17FN2O3
Mol. Mass.:
376.3804
SMILES:
CCC1(OCC(=O)Nc2ccc(cc12)-c1cc(F)cc(c1)C#N)c1ccco1
: