Target
Progesterone receptor
Ligand
BDBM50270576
Substrate
Meas. Tech.
ChEMBL_553966 (CHEMBL965384)
IC50
34.6±n/a nM
Citation
 Zhang, PKern, JCTerefenko, EAFensome, AUnwalla, RZhang, ZCohen, JBerrodin, TJYudt, MRWinneker, RCWrobel, J 7-aryl 1,5-dihydro-benzo[e][1,4]oxazepin-2-ones and analogs as non-steroidal progesterone receptor antagonists. Bioorg Med Chem 16:6589-600 (2008)  
Target
Name:
Progesterone receptor
Synonyms:
NR3C3 PGR PRGR_HUMAN | progesterone
Type:
Protein
Mol. Mass.:
98979.52
Organism:
Homo sapiens (Human)
Description:
P06401
Residue:
933
  
Inhibitor
Name:
BDBM50270576
Synonyms:
3-Chloro-5-(5,5-dimethyl-2-oxo-1,2,3,5-tetrahydro-4,1-benzoxazepin-7-yl)benzonitrile | CHEMBL487729
Type:
Small organic molecule
Emp. Form.:
C18H15ClN2O2
Mol. Mass.:
326.777
SMILES:
CC1(C)OCC(=O)Nc2ccc(cc12)-c1cc(Cl)cc(c1)C#N
: