Target
Progesterone receptor
Ligand
BDBM50270627
Substrate
Meas. Tech.
ChEMBL_553966 (CHEMBL965384)
IC50
30.1±n/a nM
Citation
 Zhang, PKern, JCTerefenko, EAFensome, AUnwalla, RZhang, ZCohen, JBerrodin, TJYudt, MRWinneker, RCWrobel, J 7-aryl 1,5-dihydro-benzo[e][1,4]oxazepin-2-ones and analogs as non-steroidal progesterone receptor antagonists. Bioorg Med Chem 16:6589-600 (2008)  
Target
Name:
Progesterone receptor
Synonyms:
NR3C3 PGR PRGR_HUMAN | progesterone
Type:
Protein
Mol. Mass.:
98979.52
Organism:
Homo sapiens (Human)
Description:
P06401
Residue:
933
  
Inhibitor
Name:
BDBM50270627
Synonyms:
7-(3-Chloro-4-fluorophenyl)-5,5-dimethyl-1,5-dihydro-4,1-benzoxazepin-2(H)-one | CHEMBL529665
Type:
Small organic molecule
Emp. Form.:
C17H15ClFNO2
Mol. Mass.:
319.758
SMILES:
CC1(C)OCC(=O)Nc2ccc(cc12)-c1ccc(F)c(Cl)c1
: