Target
Progesterone receptor
Ligand
BDBM50270626
Substrate
Meas. Tech.
ChEMBL_553966 (CHEMBL965384)
IC50
30±n/a nM
Citation
 Zhang, PKern, JCTerefenko, EAFensome, AUnwalla, RZhang, ZCohen, JBerrodin, TJYudt, MRWinneker, RCWrobel, J 7-aryl 1,5-dihydro-benzo[e][1,4]oxazepin-2-ones and analogs as non-steroidal progesterone receptor antagonists. Bioorg Med Chem 16:6589-600 (2008)  
Target
Name:
Progesterone receptor
Synonyms:
NR3C3 PGR PRGR_HUMAN | progesterone
Type:
Protein
Mol. Mass.:
98979.52
Organism:
Homo sapiens (Human)
Description:
P06401
Residue:
933
  
Inhibitor
Name:
BDBM50270626
Synonyms:
7-(3,5-Difluorophenyl)-5,5-dimethyl-1,5-dihydro-4,1-benzoxazepin-2(3H)-one | CHEMBL488558
Type:
Small organic molecule
Emp. Form.:
C17H15F2NO2
Mol. Mass.:
303.3033
SMILES:
CC1(C)OCC(=O)Nc2ccc(cc12)-c1cc(F)cc(F)c1
: