Target
Progesterone receptor
Ligand
BDBM50121165
Substrate
Meas. Tech.
ChEMBL_553966 (CHEMBL965384)
IC50
13±n/a nM
Citation
 Zhang, PKern, JCTerefenko, EAFensome, AUnwalla, RZhang, ZCohen, JBerrodin, TJYudt, MRWinneker, RCWrobel, J 7-aryl 1,5-dihydro-benzo[e][1,4]oxazepin-2-ones and analogs as non-steroidal progesterone receptor antagonists. Bioorg Med Chem 16:6589-600 (2008)  
Target
Name:
Progesterone receptor
Synonyms:
NR3C3 PGR PRGR_HUMAN | progesterone
Type:
Protein
Mol. Mass.:
98979.52
Organism:
Homo sapiens (Human)
Description:
P06401
Residue:
933
  
Inhibitor
Name:
BDBM50121165
Synonyms:
3-(3,3-Dimethyl-2-oxo-2,3-dihydro-1H-indol-5-yl)-5-fluoro-benzonitrile CHEMBL117518
Type:
Small organic molecule
Emp. Form.:
C17H13FN2O
Mol. Mass.:
280.2963
SMILES:
CC1(C)C(=O)Nc2ccc(cc12)-c1cc(F)cc(c1)C#N
: