Target
Progesterone receptor
Ligand
BDBM50270634
Substrate
Meas. Tech.
ChEMBL_553966 (CHEMBL965384)
IC50
34.1±n/a nM
Citation
 Zhang, PKern, JCTerefenko, EAFensome, AUnwalla, RZhang, ZCohen, JBerrodin, TJYudt, MRWinneker, RCWrobel, J 7-aryl 1,5-dihydro-benzo[e][1,4]oxazepin-2-ones and analogs as non-steroidal progesterone receptor antagonists. Bioorg Med Chem 16:6589-600 (2008)  
Target
Name:
Progesterone receptor
Synonyms:
NR3C3 PGR PRGR_HUMAN | progesterone
Type:
Protein
Mol. Mass.:
98979.52
Organism:
Homo sapiens (Human)
Description:
P06401
Residue:
933
  
Inhibitor
Name:
BDBM50270634
Synonyms:
7-(3-Chloro-4-fluorophenyl)-5-(2-furyl)-5-(pentafluoroethyl)-1,5-dihydro-4,1-benzoxazepin-2(H)-one | CHEMBL530109
Type:
Small organic molecule
Emp. Form.:
C22H12F6N2O3
Mol. Mass.:
466.3327
SMILES:
Fc1cc(cc(c1)-c1ccc2NC(=O)COC(c3ccco3)(c2c1)C(F)(F)C(F)(F)F)C#N
: