Target
Progesterone receptor
Ligand
BDBM50270606
Substrate
Meas. Tech.
ChEMBL_553966 (CHEMBL965384)
IC50
29.9±n/a nM
Citation
 Zhang, PKern, JCTerefenko, EAFensome, AUnwalla, RZhang, ZCohen, JBerrodin, TJYudt, MRWinneker, RCWrobel, J 7-aryl 1,5-dihydro-benzo[e][1,4]oxazepin-2-ones and analogs as non-steroidal progesterone receptor antagonists. Bioorg Med Chem 16:6589-600 (2008)  
Target
Name:
Progesterone receptor
Synonyms:
NR3C3 PGR PRGR_HUMAN | progesterone
Type:
Protein
Mol. Mass.:
98979.52
Organism:
Homo sapiens (Human)
Description:
P06401
Residue:
933
  
Inhibitor
Name:
BDBM50270606
Synonyms:
4-[5-ethyl-5-(furan-2-yl)-2-oxo-1,2,3,5-tetrahydro-4,1-benzoxazepin-7-yl]furan-2-carbonitrile | CHEMBL486915
Type:
Small organic molecule
Emp. Form.:
C20H16N2O4
Mol. Mass.:
348.352
SMILES:
CCC1(OCC(=O)Nc2ccc(cc12)-c1coc(c1)C#N)c1ccco1
: