Target
Progesterone receptor
Ligand
BDBM50270605
Substrate
Meas. Tech.
ChEMBL_553966 (CHEMBL965384)
IC50
1000±n/a nM
Citation
 Zhang, PKern, JCTerefenko, EAFensome, AUnwalla, RZhang, ZCohen, JBerrodin, TJYudt, MRWinneker, RCWrobel, J 7-aryl 1,5-dihydro-benzo[e][1,4]oxazepin-2-ones and analogs as non-steroidal progesterone receptor antagonists. Bioorg Med Chem 16:6589-600 (2008)  
Target
Name:
Progesterone receptor
Synonyms:
NR3C3 PGR PRGR_HUMAN | progesterone
Type:
Protein
Mol. Mass.:
98979.52
Organism:
Homo sapiens (Human)
Description:
P06401
Residue:
933
  
Inhibitor
Name:
BDBM50270605
Synonyms:
3-[5,5-bis(5-chlorothiophen-2-yl)-2-oxo-1,2,3,5-tetrahydro-4,1-benzoxazepin-7-yl]-5-fluorobenzonitrile | CHEMBL521049
Type:
Small organic molecule
Emp. Form.:
C24H13Cl2FN2O2S2
Mol. Mass.:
515.407
SMILES:
Fc1cc(cc(c1)-c1ccc2NC(=O)COC(c3ccc(Cl)s3)(c3ccc(Cl)s3)c2c1)C#N
: