Target
Progesterone receptor
Ligand
BDBM50270581
Substrate
Meas. Tech.
ChEMBL_553966 (CHEMBL965384)
IC50
65.2±n/a nM
Citation
 Zhang, PKern, JCTerefenko, EAFensome, AUnwalla, RZhang, ZCohen, JBerrodin, TJYudt, MRWinneker, RCWrobel, J 7-aryl 1,5-dihydro-benzo[e][1,4]oxazepin-2-ones and analogs as non-steroidal progesterone receptor antagonists. Bioorg Med Chem 16:6589-600 (2008)  
Target
Name:
Progesterone receptor
Synonyms:
NR3C3 PGR PRGR_HUMAN | progesterone
Type:
Protein
Mol. Mass.:
98979.52
Organism:
Homo sapiens (Human)
Description:
P06401
Residue:
933
  
Inhibitor
Name:
BDBM50270581
Synonyms:
7-(3-Chloro-4-fluorophenyl)-5,5-dithien-2-yl-1,5-dihydro-4,1-benzoxazepin-2(H)-one | CHEMBL519883
Type:
Small organic molecule
Emp. Form.:
C23H15ClFNO2S2
Mol. Mass.:
455.952
SMILES:
Fc1ccc(cc1Cl)-c1ccc2NC(=O)COC(c3cccs3)(c3cccs3)c2c1
: