Target
Tyrosine-protein kinase ZAP-70
Ligand
BDBM26402
Substrate
Meas. Tech.
ChEMBL_537398 (CHEMBL992588)
IC50
10000±n/a nM
Citation
 Hirabayashi, AMukaiyama, HKobayashi, HShiohara, HNakayama, SOzawa, MTsuji, EMiyazawa, KMisawa, KOhnota, HIsaji, M Structure-activity relationship studies of imidazo[1,2-c]pyrimidine derivatives as potent and orally effective Syk family kinases inhibitors. Bioorg Med Chem 16:9247-60 (2008)  
Target
Name:
Tyrosine-protein kinase ZAP-70
Synonyms:
70 kDa zeta-associated protein Syk-related tyrosine kinase Tyrosine-protein kinase ZAP-70 Tyrosine-protein kinase ZAP-70 (ZAP70) ZAP70 Zeta-chain (TCR) associated protein kinase 70kDa
Type:
Enzyme
Mol. Mass.:
69881.61
Organism:
Homo sapiens (Human)
Description:
ZAP-70 SH2 domain was expressed and purified from E. coli using O-phospho-L-tyrosine-agarose column.
Residue:
619
  
Inhibitor
Name:
BDBM26402
Synonyms:
5-amino-7-[(3,5-dimethoxyphenyl)amino]imidazo[1,2-a]pyrimidine-8-carboxamide imidazo[1,2-c]pyrimidine-8-carboxamide, 10a
Type:
Small organic molecule
Emp. Form.:
C15H16N6O3
Mol. Mass.:
328.3259
SMILES:
COc1cc(Nc2nc(N)n3ccnc3c2C(N)=O)cc(OC)c1
: